Fix maximum value vs. value count for SEQNO_SPACE and TIMESTAMP_SPACE.

6 jobs for develop in 1 minute and 11 seconds (queued for 3 seconds)
Status Job ID Name Coverage
  Build
passed #7948
docker
build:container

00:00:22

passed #7947
cmake
build:prrt

00:00:33

 
  Test
failed #7950
bash
test:prrt_functional

00:00:07

passed #7949
valgrind
test:prrt_mem

00:00:37

passed #7951
python3 bash
test:prrt_python_bindings

00:00:14

 
  Deploy
skipped #7952
python3
deploy:pypi
 
Name Stage Failure
failed
test:prrt_functional Test There is an unknown failure, please try again

[----------] Global test environment tear-down
[==========] 20 tests from 6 test cases ran. (18 ms total)
[ PASSED ] 19 tests.
[ FAILED ] 1 test, listed below:
[ FAILED ] UtilTests.Timestamps

1 FAILED TEST
ERROR: Job failed: exit status 1