Pacing.

6 jobs for feature/congestionControl in 21 seconds (queued for 2 seconds)
Status Job ID Name Coverage
  Build
passed #5454
docker
build:container

00:00:21

failed #5453
cmake
build:prrt

00:00:17

 
  Test
skipped #5456
bash
test:prrt_functional
skipped #5455
valgrind
test:prrt_mem
skipped #5457
python3 bash
test:prrt_python_bindings
 
  Deploy
skipped #5458
python3
deploy:pypi
 
Name Stage Failure
failed
build:prrt Build There is an unknown failure, please try again
  atomic_int items;
^
tests/CMakeFiles/prrtTests.dir/build.make:86: recipe for target 'tests/CMakeFiles/prrtTests.dir/receptionTable_tests.cpp.o' failed
make[2]: *** [tests/CMakeFiles/prrtTests.dir/receptionTable_tests.cpp.o] Error 1
CMakeFiles/Makefile2:478: recipe for target 'tests/CMakeFiles/prrtTests.dir/all' failed
make[1]: *** [tests/CMakeFiles/prrtTests.dir/all] Error 2
Makefile:138: recipe for target 'all' failed
make: *** [all] Error 2
ERROR: Job failed: exit status 1