Update BBR.

6 jobs for feature/congestionControl in 22 seconds (queued for 3 seconds)
Status Job ID Name Coverage
  Build
passed #5382
docker
build:container

00:00:22

failed #5381
cmake
build:prrt

00:00:18

 
  Test
skipped #5384
bash
test:prrt_functional
skipped #5383
valgrind
test:prrt_mem
skipped #5385
python3 bash
test:prrt_python_bindings
 
  Deploy
skipped #5386
python3
deploy:pypi
 
Name Stage Failure
failed
build:prrt Build There is an unknown failure, please try again
  atomic_int items;
^
tests/CMakeFiles/prrtTests.dir/build.make:86: recipe for target 'tests/CMakeFiles/prrtTests.dir/receptionTable_tests.cpp.o' failed
make[2]: *** [tests/CMakeFiles/prrtTests.dir/receptionTable_tests.cpp.o] Error 1
CMakeFiles/Makefile2:478: recipe for target 'tests/CMakeFiles/prrtTests.dir/all' failed
make[1]: *** [tests/CMakeFiles/prrtTests.dir/all] Error 2
Makefile:138: recipe for target 'all' failed
make: *** [all] Error 2
ERROR: Job failed: exit status 1