Fix block test

6 jobs for develop in 1 minute and 27 seconds (queued for 2 seconds)
Status Name Job ID Coverage
  Build
passed build:prrt #13641
docker

00:00:30

 
  Test
failed test:prrt_functional #13643
docker

00:00:55

passed test:prrt_mem #13642
docker

00:00:48

passed test:prrt_python_bindings #13644
docker

00:00:49

 
  Deploy
skipped deploy:profile #13646
docker
skipped deploy:pypi #13645
docker
 
Name Stage Failure
failed
test:prrt_functional Test There is an unknown failure, please try again
[ 86%] Building CXX object tests/CMakeFiles/prrtTests.dir/bptree_tests.cpp.o
[ 87%] Building CXX object tests/CMakeFiles/prrtTests.dir/PrrtBlock_tests.cpp.o
/builds/LARN/PRRT/tests/PrrtBlock_tests.cpp: In member function 'virtual void PrrtBlockTest_NoCodingConfigured_Test::TestBody()':
/builds/LARN/PRRT/tests/PrrtBlock_tests.cpp:228:32: error: 'PrrtBlock_get_first_data' was not declared in this scope; did you mean 'PrrtBlock_get_next_data'?
228 | PrrtPacket *data_pkt = PrrtBlock_get_first_data(encBlock);
| ^~~~~~~~~~~~~~~~~~~~~~~~
| PrrtBlock_get_next_data
make[2]: *** [tests/CMakeFiles/prrtTests.dir/build.make:128: tests/CMakeFiles/prrtTests.dir/PrrtBlock_tests.cpp.o] Error 1
make[1]: *** [CMakeFiles/Makefile2:624: tests/CMakeFiles/prrtTests.dir/all] Error 2
make: *** [Makefile:141: all] Error 2