Fix small bug

6 jobs for develop in 1 minute and 30 seconds (queued for 1 second)
Status Name Job ID Coverage
  Build
passed build:prrt #13635
docker

00:00:31

 
  Test
failed test:prrt_functional #13637
docker

00:00:58

passed test:prrt_mem #13636
docker

00:00:46

passed test:prrt_python_bindings #13638
docker

00:00:49

 
  Deploy
skipped deploy:profile #13640
docker
skipped deploy:pypi #13639
docker
 
Name Stage Failure
failed
test:prrt_functional Test There is an unknown failure, please try again
/builds/LARN/PRRT/prrt/proto/types/../../util/list.h:28:25: note: in definition of macro 'List_count'
28 | #define List_count(A) ((A)->count)
| ^
/builds/LARN/PRRT/tests/PrrtBlock_tests.cpp:228:32: error: 'PrrtBlock_get_first_data' was not declared in this scope; did you mean 'PrrtBlock_get_next_data'?
228 | PrrtPacket *data_pkt = PrrtBlock_get_first_data(encBlock);
| ^~~~~~~~~~~~~~~~~~~~~~~~
| PrrtBlock_get_next_data
make[2]: *** [tests/CMakeFiles/prrtTests.dir/build.make:128: tests/CMakeFiles/prrtTests.dir/PrrtBlock_tests.cpp.o] Error 1
make[1]: *** [CMakeFiles/Makefile2:624: tests/CMakeFiles/prrtTests.dir/all] Error 2
make: *** [Makefile:141: all] Error 2