Add sync/async receive modes.

7 jobs for feature/congestionControl in 19 seconds
Status Job ID Name Coverage
  Build
failed #7160
docker
build:container

00:00:18

failed #7161
docker
build:container_tcp

00:00:18

failed #7159
cmake
build:prrt

00:00:10

 
  Test
skipped #7163
bash
test:prrt_functional
skipped #7162
valgrind
test:prrt_mem
skipped #7164
python3 bash
test:prrt_python_bindings
 
  Deploy
skipped #7165
python3
deploy:pypi
 
Name Stage Failure
failed
build:container_tcp Build There is an unknown failure, please try again
collect2: error: ld returned 1 exit status
prrt/CMakeFiles/sender.dir/build.make:88: recipe for target 'sender' failed
make[2]: *** [sender] Error 1
CMakeFiles/Makefile2:186: recipe for target 'prrt/CMakeFiles/sender.dir/all' failed
make[1]: *** [prrt/CMakeFiles/sender.dir/all] Error 2
Makefile:76: recipe for target 'all' failed
make: *** [all] Error 2
The command '/bin/sh -c cmake -DTCP=1 . && make' returned a non-zero code: 2
ERROR: Job failed: exit status 1
failed
build:container Build There is an unknown failure, please try again
collect2: error: ld returned 1 exit status
prrt/CMakeFiles/sender.dir/build.make:88: recipe for target 'sender' failed
make[2]: *** [sender] Error 1
CMakeFiles/Makefile2:186: recipe for target 'prrt/CMakeFiles/sender.dir/all' failed
make[1]: *** [prrt/CMakeFiles/sender.dir/all] Error 2
Makefile:76: recipe for target 'all' failed
make: *** [all] Error 2
The command '/bin/sh -c cmake . && make' returned a non-zero code: 2
ERROR: Job failed: exit status 1
failed
build:prrt Build There is an unknown failure, please try again
sender.c:(.text.startup+0x205): undefined reference to `PrrtSocket_send'
collect2: error: ld returned 1 exit status
prrt/CMakeFiles/sender.dir/build.make:97: recipe for target 'sender' failed
make[2]: *** [sender] Error 1
CMakeFiles/Makefile2:232: recipe for target 'prrt/CMakeFiles/sender.dir/all' failed
make[1]: *** [prrt/CMakeFiles/sender.dir/all] Error 2
Makefile:138: recipe for target 'all' failed
make: *** [all] Error 2
ERROR: Job failed: exit status 1