Enable pacing on demand.

6 jobs for feature/congestionControl in 15 seconds (queued for 3 seconds)
Status Job ID Name Coverage
  Build
failed #5486
docker
build:container

00:00:15

failed #5485
cmake
build:prrt

00:00:10

 
  Test
skipped #5488
bash
test:prrt_functional
skipped #5487
valgrind
test:prrt_mem
skipped #5489
python3 bash
test:prrt_python_bindings
 
  Deploy
skipped #5490
python3
deploy:pypi
 
Name Stage Failure
failed
build:container Build There is an unknown failure, please try again
/prrt/prrt/time-protocol.h:116:8: note: each undeclared identifier is reported only once for each function it appears in
prrt/CMakeFiles/time-receiver.dir/build.make:54: recipe for target 'prrt/CMakeFiles/time-receiver.dir/time-receiver.c.o' failed
make[2]: *** [prrt/CMakeFiles/time-receiver.dir/time-receiver.c.o] Error 1
make[1]: *** [prrt/CMakeFiles/time-receiver.dir/all] Error 2
CMakeFiles/Makefile2:222: recipe for target 'prrt/CMakeFiles/time-receiver.dir/all' failed
make: *** [all] Error 2
Makefile:76: recipe for target 'all' failed
The command '/bin/sh -c cmake . && make' returned a non-zero code: 2
ERROR: Job failed: exit status 1
failed
build:prrt Build There is an unknown failure, please try again
        ^
/home/gitlab-runner/builds/3a5409e2/0/LARN/PRRT/prrt/time-protocol.h:116:8: note: each undeclared identifier is reported only once for each function it appears in
prrt/CMakeFiles/time-sender.dir/build.make:62: recipe for target 'prrt/CMakeFiles/time-sender.dir/time-sender.c.o' failed
make[2]: *** [prrt/CMakeFiles/time-sender.dir/time-sender.c.o] Error 1
CMakeFiles/Makefile2:270: recipe for target 'prrt/CMakeFiles/time-sender.dir/all' failed
make[1]: *** [prrt/CMakeFiles/time-sender.dir/all] Error 2
Makefile:138: recipe for target 'all' failed
make: *** [all] Error 2
ERROR: Job failed: exit status 1